Intereting Posts
Требует ли Kotlin рамки DI? Как справляться с проблемой перегрузки неоднозначность функций с дженериками? Как получить дочерний jSON-объект в Android При щелчке спискаView Как этот сильный синтаксис переводится в котлин? Gradle kotlin script,> Плагин с id `kotlin` не найден Kotlin Back-Tick в именах методов: как это работает? Android Build Crashes после подписанной сборки использовать kotlin для springmvc Не удалось создать экземпляр класса данных класса bean Может ли Kotlin разрешить функцию, возвращающую значение типа реализации этого интерфейса? Плагин IdeaVim от IntelliJ отключает преобразование Java в Kotlin Как передать аргументы в скрипт kotlin? Как избежать выражения объекта для функций, возвращающих интерфейс SAM Как использовать 2-значный квалификатор Dagger's 2 в Kotlin Kotlin HashMap содержит ключи, используя массив Kotlin / Java, строковый массив еще не инициализирован при вызове метода

Не удается создать приложение Android (с Kotlin) с Gradle: «comand« java.exe »завершен с ненулевым значением выхода 1»

Я пишу Android-приложение с помощью Kotlin и Anko. Все было в порядке, пока я не создал пару довольно сложных классов. Теперь во время сборки Gradle дает мне

Dexing C: \ Programming \ AndroidStudioProjects \ ListDungeon \ app \ build \ intermediates \ transforms \ instantRunSlicer \ dev \ debug \ jars \ 1 \ 5 \ main_sliceb.jar взял 1050
: app: transformClassesWithDexForDevDebug FAILED
FAILURE: Сбой сборки с исключением.

Что пошло не так:
Выполнение не выполнено для задачи ': app: transformClassesWithDexForDevDebug'.
com.android.build.api.transform.TransformException: java.lang.RuntimeException: com.android.ide.common.process.ProcessException: java.util.concurrent.ExecutionException: com.android.ide.common.process.ProcessException: org.gradle.process.internal.ExecException: процесс «команда» C: \ Program Files \ Java \ jdk1.8.0_31 \ bin \ java.exe '' завершен с ненулевым значением выхода 1

Я пробовал некоторые вещи, которые я искал в этой ошибке

  • Очистить – Недействительные кеши – Перестроить
  • multiDexEnabled true
  • javaMaxHeapSize "4g"

И ничего не работает

Также я попытался удалить этот класс (но мне это действительно нужно). Все скомпилировано, но с запуском ClassNotFoundException


Этот класс

open class SetStat<T> protected constructor (override val default: Set<T> = setOf<T>()): Stat<Set<T>>(default) 

даже без какого-либо содержимого вызывает сбои сборки во время дексинга.

: app: transformClassesWithDexForDevDebug FAILED … Процесс «команда» C: \ Program Files \ Java \ jdk1.8.0_31 \ bin \ java.exe '' завершен с ненулевым значением выхода 1

Мой файл build.gradle:

 apply plugin: 'com.android.application' apply plugin: 'kotlin-android' android { compileSdkVersion 23 buildToolsVersion "23.0.2" defaultConfig { applicationId "com.gmail.ivkhegay.listdungeon" minSdkVersion 16 targetSdkVersion 23 versionCode 1 versionName "1.0" multiDexEnabled true } buildTypes { release { minifyEnabled false proguardFiles getDefaultProguardFile('proguard-android.txt'), 'proguard-rules.pro' } } sourceSets { main.java.srcDirs += 'src/main/kotlin' } dexOptions { javaMaxHeapSize "4g" incremental true } compileOptions { sourceCompatibility JavaVersion.VERSION_1_7 targetCompatibility JavaVersion.VERSION_1_7 } productFlavors { dev { minSdkVersion 23 } prod { minSdkVersion 16 } } } dependencies { compile fileTree(include: ['*.jar'], dir: 'libs') testCompile 'junit:junit:4.12' compile 'com.android.support:multidex:1.0.1' compile 'com.android.support:appcompat-v7:23.2.0' compile 'org.jetbrains.kotlin:kotlin-stdlib:1.0.0' compile 'org.jetbrains.anko:anko-sdk23:0.8.+' compile 'org.jetbrains.anko:anko-support-v4:0.8' compile 'org.jetbrains.anko:anko-appcompat-v7:0.8' } 

 FAILURE: Build failed with an exception. * What went wrong: Execution failed for task ':app:transformClassesWithDexForDevDebug'. > com.android.build.api.transform.TransformException: com.android.ide.common.process.ProcessException: org.gradle.process.internal.ExecException: Process 'command 'C:\Program Files\Java\jdk1.8.0_31\bin\java.exe'' finished with non-zero exit value 1 * Try: Run with --info or --debug option to get more log output. * Exception is: org.gradle.api.tasks.TaskExecutionException: Execution failed for task ':app:transformClassesWithDexForDevDebug'. at org.gradle.api.internal.tasks.execution.ExecuteActionsTaskExecuter.executeActions(ExecuteActionsTaskExecuter.java:69) at org.gradle.api.internal.tasks.execution.ExecuteActionsTaskExecuter.execute(ExecuteActionsTaskExecuter.java:46) at org.gradle.api.internal.tasks.execution.PostExecutionAnalysisTaskExecuter.execute(PostExecutionAnalysisTaskExecuter.java:35) at org.gradle.api.internal.tasks.execution.SkipUpToDateTaskExecuter.execute(SkipUpToDateTaskExecuter.java:64) at org.gradle.api.internal.tasks.execution.ValidatingTaskExecuter.execute(ValidatingTaskExecuter.java:58) at org.gradle.api.internal.tasks.execution.SkipEmptySourceFilesTaskExecuter.execute(SkipEmptySourceFilesTaskExecuter.java:52) at org.gradle.api.internal.tasks.execution.SkipTaskWithNoActionsExecuter.execute(SkipTaskWithNoActionsExecuter.java:52) at org.gradle.api.internal.tasks.execution.SkipOnlyIfTaskExecuter.execute(SkipOnlyIfTaskExecuter.java:53) at org.gradle.api.internal.tasks.execution.ExecuteAtMostOnceTaskExecuter.execute(ExecuteAtMostOnceTaskExecuter.java:43) at org.gradle.execution.taskgraph.DefaultTaskGraphExecuter$EventFiringTaskWorker.execute(DefaultTaskGraphExecuter.java:203) at org.gradle.execution.taskgraph.DefaultTaskGraphExecuter$EventFiringTaskWorker.execute(DefaultTaskGraphExecuter.java:185) at org.gradle.execution.taskgraph.AbstractTaskPlanExecutor$TaskExecutorWorker.processTask(AbstractTaskPlanExecutor.java:66) at org.gradle.execution.taskgraph.AbstractTaskPlanExecutor$TaskExecutorWorker.run(AbstractTaskPlanExecutor.java:50) at org.gradle.execution.taskgraph.ParallelTaskPlanExecutor.process(ParallelTaskPlanExecutor.java:47) at org.gradle.execution.taskgraph.DefaultTaskGraphExecuter.execute(DefaultTaskGraphExecuter.java:110) at org.gradle.execution.SelectedTaskExecutionAction.execute(SelectedTaskExecutionAction.java:37) at org.gradle.execution.DefaultBuildExecuter.execute(DefaultBuildExecuter.java:37) at org.gradle.execution.DefaultBuildExecuter.access$000(DefaultBuildExecuter.java:23) at org.gradle.execution.DefaultBuildExecuter$1.proceed(DefaultBuildExecuter.java:43) at org.gradle.execution.DryRunBuildExecutionAction.execute(DryRunBuildExecutionAction.java:32) at org.gradle.execution.DefaultBuildExecuter.execute(DefaultBuildExecuter.java:37) at org.gradle.execution.DefaultBuildExecuter.execute(DefaultBuildExecuter.java:30) at org.gradle.initialization.DefaultGradleLauncher$4.run(DefaultGradleLauncher.java:154) at org.gradle.internal.Factories$1.create(Factories.java:22) at org.gradle.internal.progress.DefaultBuildOperationExecutor.run(DefaultBuildOperationExecutor.java:90) at org.gradle.internal.progress.DefaultBuildOperationExecutor.run(DefaultBuildOperationExecutor.java:52) at org.gradle.initialization.DefaultGradleLauncher.doBuildStages(DefaultGradleLauncher.java:151) at org.gradle.initialization.DefaultGradleLauncher.access$200(DefaultGradleLauncher.java:32) at org.gradle.initialization.DefaultGradleLauncher$1.create(DefaultGradleLauncher.java:99) at org.gradle.initialization.DefaultGradleLauncher$1.create(DefaultGradleLauncher.java:93) at org.gradle.internal.progress.DefaultBuildOperationExecutor.run(DefaultBuildOperationExecutor.java:90) at org.gradle.internal.progress.DefaultBuildOperationExecutor.run(DefaultBuildOperationExecutor.java:62) at org.gradle.initialization.DefaultGradleLauncher.doBuild(DefaultGradleLauncher.java:93) at org.gradle.initialization.DefaultGradleLauncher.run(DefaultGradleLauncher.java:82) at org.gradle.launcher.exec.InProcessBuildActionExecuter$DefaultBuildController.run(InProcessBuildActionExecuter.java:94) at org.gradle.tooling.internal.provider.runner.BuildModelActionRunner.run(BuildModelActionRunner.java:46) at org.gradle.launcher.exec.ChainingBuildActionRunner.run(ChainingBuildActionRunner.java:35) at org.gradle.tooling.internal.provider.runner.SubscribableBuildActionRunner.run(SubscribableBuildActionRunner.java:58) at org.gradle.launcher.exec.ChainingBuildActionRunner.run(ChainingBuildActionRunner.java:35) at org.gradle.launcher.exec.InProcessBuildActionExecuter.execute(InProcessBuildActionExecuter.java:43) at org.gradle.launcher.exec.InProcessBuildActionExecuter.execute(InProcessBuildActionExecuter.java:28) at org.gradle.launcher.exec.ContinuousBuildActionExecuter.execute(ContinuousBuildActionExecuter.java:78) at org.gradle.launcher.exec.ContinuousBuildActionExecuter.execute(ContinuousBuildActionExecuter.java:48) at org.gradle.launcher.daemon.server.exec.ExecuteBuild.doBuild(ExecuteBuild.java:52) at org.gradle.launcher.daemon.server.exec.BuildCommandOnly.execute(BuildCommandOnly.java:36) at org.gradle.launcher.daemon.server.api.DaemonCommandExecution.proceed(DaemonCommandExecution.java:120) at org.gradle.launcher.daemon.server.exec.WatchForDisconnection.execute(WatchForDisconnection.java:37) at org.gradle.launcher.daemon.server.api.DaemonCommandExecution.proceed(DaemonCommandExecution.java:120) at org.gradle.launcher.daemon.server.exec.ResetDeprecationLogger.execute(ResetDeprecationLogger.java:26) at org.gradle.launcher.daemon.server.api.DaemonCommandExecution.proceed(DaemonCommandExecution.java:120) at org.gradle.launcher.daemon.server.exec.RequestStopIfSingleUsedDaemon.execute(RequestStopIfSingleUsedDaemon.java:34) at org.gradle.launcher.daemon.server.api.DaemonCommandExecution.proceed(DaemonCommandExecution.java:120) at org.gradle.launcher.daemon.server.exec.ForwardClientInput$2.call(ForwardClientInput.java:74) at org.gradle.launcher.daemon.server.exec.ForwardClientInput$2.call(ForwardClientInput.java:72) at org.gradle.util.Swapper.swap(Swapper.java:38) at org.gradle.launcher.daemon.server.exec.ForwardClientInput.execute(ForwardClientInput.java:72) at org.gradle.launcher.daemon.server.api.DaemonCommandExecution.proceed(DaemonCommandExecution.java:120) at org.gradle.launcher.daemon.server.health.DaemonHealthTracker.execute(DaemonHealthTracker.java:47) at org.gradle.launcher.daemon.server.api.DaemonCommandExecution.proceed(DaemonCommandExecution.java:120) at org.gradle.launcher.daemon.server.exec.LogToClient.doBuild(LogToClient.java:66) at org.gradle.launcher.daemon.server.exec.BuildCommandOnly.execute(BuildCommandOnly.java:36) at org.gradle.launcher.daemon.server.api.DaemonCommandExecution.proceed(DaemonCommandExecution.java:120) at org.gradle.launcher.daemon.server.exec.EstablishBuildEnvironment.doBuild(EstablishBuildEnvironment.java:72) at org.gradle.launcher.daemon.server.exec.BuildCommandOnly.execute(BuildCommandOnly.java:36) at org.gradle.launcher.daemon.server.api.DaemonCommandExecution.proceed(DaemonCommandExecution.java:120) at org.gradle.launcher.daemon.server.health.HintGCAfterBuild.execute(HintGCAfterBuild.java:41) at org.gradle.launcher.daemon.server.api.DaemonCommandExecution.proceed(DaemonCommandExecution.java:120) at org.gradle.launcher.daemon.server.exec.StartBuildOrRespondWithBusy$1.run(StartBuildOrRespondWithBusy.java:50) at org.gradle.launcher.daemon.server.DaemonStateCoordinator$1.run(DaemonStateCoordinator.java:246) at org.gradle.internal.concurrent.ExecutorPolicy$CatchAndRecordFailures.onExecute(ExecutorPolicy.java:54) at org.gradle.internal.concurrent.StoppableExecutorImpl$1.run(StoppableExecutorImpl.java:40) Caused by: java.lang.RuntimeException: com.android.build.api.transform.TransformException: com.android.ide.common.process.ProcessException: org.gradle.process.internal.ExecException: Process 'command 'C:\Program Files\Java\jdk1.8.0_31\bin\java.exe'' finished with non-zero exit value 1 at com.android.builder.profile.Recorder$Block.handleException(Recorder.java:54) at com.android.builder.profile.ThreadRecorder$1.record(ThreadRecorder.java:57) at com.android.builder.profile.ThreadRecorder$1.record(ThreadRecorder.java:47) at com.android.build.gradle.internal.pipeline.TransformTask.transform(TransformTask.java:173) at org.gradle.internal.reflect.JavaMethod.invoke(JavaMethod.java:75) at org.gradle.api.internal.project.taskfactory.AnnotationProcessingTaskFactory$IncrementalTaskAction.doExecute(AnnotationProcessingTaskFactory.java:244) at org.gradle.api.internal.project.taskfactory.AnnotationProcessingTaskFactory$StandardTaskAction.execute(AnnotationProcessingTaskFactory.java:220) at org.gradle.api.internal.project.taskfactory.AnnotationProcessingTaskFactory$IncrementalTaskAction.execute(AnnotationProcessingTaskFactory.java:231) at org.gradle.api.internal.project.taskfactory.AnnotationProcessingTaskFactory$StandardTaskAction.execute(AnnotationProcessingTaskFactory.java:209) at org.gradle.api.internal.tasks.execution.ExecuteActionsTaskExecuter.executeAction(ExecuteActionsTaskExecuter.java:80) at org.gradle.api.internal.tasks.execution.ExecuteActionsTaskExecuter.executeActions(ExecuteActionsTaskExecuter.java:61) ... 70 more Caused by: com.android.build.api.transform.TransformException: com.android.ide.common.process.ProcessException: org.gradle.process.internal.ExecException: Process 'command 'C:\Program Files\Java\jdk1.8.0_31\bin\java.exe'' finished with non-zero exit value 1 at com.android.build.gradle.internal.transforms.DexTransform.transform(DexTransform.java:422) at com.android.build.gradle.internal.pipeline.TransformTask$3.call(TransformTask.java:178) at com.android.build.gradle.internal.pipeline.TransformTask$3.call(TransformTask.java:174) at com.android.builder.profile.ThreadRecorder$1.record(ThreadRecorder.java:55) ... 79 more Caused by: com.android.ide.common.process.ProcessException: org.gradle.process.internal.ExecException: Process 'command 'C:\Program Files\Java\jdk1.8.0_31\bin\java.exe'' finished with non-zero exit value 1 at com.android.build.gradle.internal.process.GradleProcessResult.assertNormalExitValue(GradleProcessResult.java:43) at com.android.builder.core.AndroidBuilder.runDexer(AndroidBuilder.java:1451) at com.android.builder.core.AndroidBuilder.convertByteCode(AndroidBuilder.java:1389) at com.android.build.gradle.internal.transforms.DexTransform.transform(DexTransform.java:250) ... 82 more Caused by: org.gradle.process.internal.ExecException: Process 'command 'C:\Program Files\Java\jdk1.8.0_31\bin\java.exe'' finished with non-zero exit value 1 at org.gradle.process.internal.DefaultExecHandle$ExecResultImpl.assertNormalExitValue(DefaultExecHandle.java:367) at com.android.build.gradle.internal.process.GradleProcessResult.assertNormalExitValue(GradleProcessResult.java:41) ... 85 more 

Solutions Collecting From Web of "Не удается создать приложение Android (с Kotlin) с Gradle: «comand« java.exe »завершен с ненулевым значением выхода 1»"